{"text_format":"1","workbook":"xlsx","n_sheets":30,"sheets":["Development Tab","Development","Open","Instructions","Menu","Home Data","HVAC Data Collection","DHW Data Collection","Insulation Levels Data Collec","Air Sealing Data Collection","Duct Sealing Data Collection","Thermostats and Controls Data ","Lighting Data Collection","HEA_References","Appliances Data Collection","Window Data Collection","Health&Safety_Data","Other Data Collection","Cover","Executive Summary","Health&Safety","Heating and Cooling","DHW","Insulation Levels","Air_Sealing ","Duct Sealing","Thermostats and Controls","Lighting","Appliances","Windows"],"not_rendered":{"charts":1,"images":33,"macros":1,"external_links":1,"defined_names":310,"comments":0,"pivot_tables":0},"unopened":[],"bounds":{"document_bytes":16777216,"sheet_cells":100000,"rows_first":2000,"rows_last":500,"rows_between":2000,"halvings":0,"cell_chars":16384,"cell_head_chars":4096},"cells_cut":0,"cells_raw":0,"read":"whole","date_system":"1900"}

{"sheet":"Development Tab","index":0,"n_rows":12,"n_cols":13,"rows_kept":12,"cut":false,"hidden":true,"merged":[[4,1,4,10],[7,1,7,10],[10,1,10,10]]}
["Program Year",2025]
["Version","1.0_Draft1"]
[]
[]
["Date","Edits",null,null,null,null,null,null,null,null,null,"Version","Initials"]
["10.21.20","Updated all Partner of the year images from 2019 to 2020",null,null,null,null,null,null,null,null,null,"Version1.0_Draft1","ED"]
["10.21.20","Results-Appliances Tab: Removed image of dishwashers and replaced with heat pump water heater",null,null,null,null,null,null,null,null,null,"Version1.0_Draft1","ED"]
["10.21.20","Results-Appliances Tab: Removed dishwasers from appliances paragraph and replaced with heat pump water heater",null,null,null,null,null,null,null,null,null,"Version1.0_Draft1","ED"]
{"$rows_left_out":5}
{"sheet":"Development","index":1,"n_rows":271,"n_cols":5,"rows_kept":271,"cut":false,"hidden":true,"merged":[]}
[]
[null,{"$f":"B6&\" Home Energy Assessment\"","v":"2025 Home Energy Assessment"}]
[null,"Home Energy Assessment"]
[null,"1.0","Current Version (Customer Inputs, Eligibility Table)"]
[null,"01.01.2025","Current Effective Date (Eligibility Table)"]
[null,2025,"Program Year"]
[]
[null,"Date","Description","Initials","Version"]
{"$rows_left_out":264}
{"sheet":"Open","index":2,"n_rows":18,"n_cols":5,"rows_kept":18,"cut":false,"hidden":false,"merged":[[11,4,15,9],[17,4,17,9],[33,0,33,13]]}
[]
[]
[]
[]
[]
[]
[]
[]
{"$rows_left_out":11}
{"sheet":"Instructions","index":3,"n_rows":47,"n_cols":4,"rows_kept":47,"cut":false,"hidden":false,"merged":[[41,1,42,15],[9,1,11,15],[12,1,12,13],[20,1,20,11],[14,1,14,15],[16,1,16,15],[18,1,18,15]]}
[{"$f":"Development!B3","v":"Home Energy Assessment"}]
[null,"Instructions"]
[]
[]
[]
[]
[]
[]
{"$rows_left_out":40}
{"sheet":"Menu","index":4,"n_rows":18,"n_cols":8,"rows_kept":18,"cut":false,"hidden":false,"merged":[[7,7,7,10],[11,7,11,10],[9,2,9,5],[11,2,11,5],[13,2,13,5],[7,2,7,5],[13,7,13,10],[9,7,9,10],[8,2,8,5],[14,7,14,10],[27,0,27,12],[21,2,21,6],[15,2,15,5],[17,7,17,10],[17,2,17,6],[15,7,15,12]]}
[]
[]
[]
[]
[]
[]
[]
[null,null,"Click to Enter Home Data",null,null,null,null,"Click to Enter Thermostat Data"]
{"$rows_left_out":11}
{"sheet":"Home Data","index":5,"n_rows":41,"n_cols":41,"rows_kept":41,"cut":false,"hidden":false,"merged":[[40,5,40,6]]}
[{"$f":"Development!B3","v":"Home Energy Assessment"},null,null,null,null,null,null,null,null,null,null,null,null,null,null,null,null,null,null,null,null,null,null,null,null,null,null,null,null,null,null,null,null,null,null,null,null,null,null,null,"College – Cafeteria"]
[null,"Home Data"]
[]
[]
[null,"Customer Information"]
[]
[null,"Account Name : ",null,null,null,null,"Application ID : "]
[]
{"$rows_left_out":34}
{"sheet":"HVAC Data Collection","index":6,"n_rows":74,"n_cols":11,"rows_kept":74,"cut":false,"hidden":false,"merged":[[7,2,7,5],[73,11,73,14],[75,11,75,14],[18,11,18,14],[20,11,20,14],[37,11,37,14],[39,11,39,14],[55,11,55,14],[57,11,57,14],[48,2,48,5],[50,2,50,5],[53,2,53,5],[64,2,64,5],[79,2,79,4],[66,2,66,5],[68,2,68,5],[71,2,71,5],[9,2,9,5],[11,2,11,5],[13,2,13,5],[16,2,16,5],[18,2,18,5],[26,2,26,5],[28,2,28,5],[30,2,30,5],[32,2,32,5],[35,2,35,5],[37,2,37,5],[46,2,46,5],[81,2,81,8],[92,2,92,4],[83,2,83,4],[85,2,85,8],[87,2,87,6]]}
[{"$f":"Development!B3","v":"Home Energy Assessment"}]
[null,"Heating and Cooling "]
[]
[]
[null,{"$f":"B4+1","v":1},"Heating System"]
[]
[]
[null,"Location:",null,null,null,null,null,null,null,"Qty:"]
{"$rows_left_out":67}
{"sheet":"DHW Data Collection","index":7,"n_rows":36,"n_cols":12,"rows_kept":36,"cut":false,"hidden":false,"merged":[[35,2,35,13],[36,2,36,13],[37,2,37,13],[27,9,27,10],[25,9,25,10],[25,2,25,4],[27,2,27,4],[23,9,23,10],[17,2,17,13],[18,2,18,13],[19,2,19,13],[23,2,23,4],[5,2,5,4],[7,2,7,4],[9,2,9,4],[9,9,9,10],[7,9,7,10],[5,9,5,10]]}
[{"$f":"Development!B3","v":"Home Energy Assessment"}]
[null,"Domestic Hot Water"]
[]
[]
[null,{"$f":"B4+1","v":1}]
[null,"Location:",null,null,null,null,null,null,"Fuel Source:"]
[]
[null,"System Type:",null,null,null,null,null,null,"Energy Factor (EF):",null,null,"(Ex. .80)"]
{"$rows_left_out":29}
{"sheet":"Insulation Levels Data Collec","index":8,"n_rows":92,"n_cols":11,"rows_kept":92,"cut":false,"hidden":false,"merged":[[91,3,91,14],[92,3,92,14],[61,3,61,14],[62,3,62,14],[76,3,76,14],[77,3,77,14],[6,3,6,5],[8,3,8,5],[10,3,10,5],[31,3,31,14],[32,3,32,14],[21,3,21,5],[23,3,23,5],[25,3,25,5],[16,3,16,14],[17,3,17,14],[36,3,36,5],[38,3,38,5],[40,3,40,5],[85,3,85,5],[83,3,83,5],[81,3,81,5],[66,3,66,5],[68,3,68,5],[70,3,70,5],[46,3,46,14],[47,3,47,14],[51,3,51,5],[53,3,53,5],[55,3,55,5]]}
[null,{"$f":"Development!B3","v":"Home Energy Assessment"}]
[null,null,"Insulation Levels"]
[]
[]
[]
[null,{"$f":"B3+1","v":1}]
[null,null,"Location:",null,null,null,null,null,null,null,"Condition:"]
[]
{"$rows_left_out":85}
{"sheet":"Air Sealing Data Collection","index":9,"n_rows":36,"n_cols":9,"rows_kept":36,"cut":false,"hidden":false,"merged":[[5,2,5,4],[5,9,5,10],[7,2,7,4],[9,2,9,4],[37,2,37,13],[23,2,23,4],[23,9,23,10],[25,2,25,4],[27,2,27,4],[17,2,17,13],[18,2,18,13],[19,2,19,13],[35,2,35,13],[36,2,36,13]]}
[{"$f":"Development!B3","v":"Home Energy Assessment"}]
[null,"Air Sealing (Air Leakage)"]
[]
[]
[null,{"$f":"B4+1","v":1}]
[null,"Square Footage:",null,null,null,null,null,null,"Blower Door Reading - CFM50 Pre:"]
[]
[null,"Conditioned Air Volume:"]
{"$rows_left_out":29}
{"sheet":"Duct Sealing Data Collection","index":10,"n_rows":65,"n_cols":11,"rows_kept":65,"cut":false,"hidden":false,"merged":[[54,2,54,3],[58,2,58,3],[64,2,64,12],[65,2,65,12],[32,2,32,12],[33,2,33,12],[38,2,38,3],[42,2,42,3],[48,2,48,12],[49,2,49,12],[40,2,40,3],[56,2,56,3],[26,2,26,3],[6,2,6,3],[10,2,10,3],[16,2,16,12],[17,2,17,12],[22,2,22,3],[8,2,8,3],[24,2,24,3]]}
[{"$f":"Development!B3","v":"Home Energy Assessment"}]
[null,"Duct Sealing"]
[]
[]
[null,{"$f":"B4+1","v":1},"Heating System "]
[]
[null,"Primary Duct Location:",null,null,null,null,null,null,"Total Ductwork Square Footage:",null,"(Feet)"]
[]
{"$rows_left_out":58}
{"sheet":"Thermostats and Controls Data ","index":11,"n_rows":36,"n_cols":9,"rows_kept":36,"cut":false,"hidden":false,"merged":[[36,2,36,13],[37,2,37,13],[25,2,25,4],[27,2,27,4],[25,9,25,10],[27,9,27,10],[23,9,23,10],[17,2,17,13],[35,2,35,13],[5,2,5,4],[7,2,7,4],[9,2,9,4],[23,2,23,4],[5,9,5,10],[18,2,18,13],[19,2,19,13],[9,9,9,10],[7,9,7,10]]}
[{"$f":"Development!B3","v":"Home Energy Assessment"}]
[null,"Thermostats and Controls"]
[]
[]
[null,{"$f":"B4+1","v":1}]
[null,"Location:",null,null,null,null,null,null,"Thermostat Type:"]
[]
[null,"Heating Set Point - High:",null,null,null,null,null,null,"Cooling Set Point - High:"]
{"$rows_left_out":29}
{"sheet":"Lighting Data Collection","index":12,"n_rows":154,"n_cols":10,"rows_kept":154,"cut":false,"hidden":false,"merged":[[134,9,134,10],[149,9,149,10],[115,9,115,10],[128,9,128,10],[130,9,130,10],[147,9,147,10],[4,3,4,7],[4,8,4,9],[153,2,153,12],[154,2,154,12],[143,2,143,3],[143,9,143,10],[145,9,145,10],[145,2,145,3],[147,2,147,3],[128,2,128,3],[138,2,138,12],[139,2,139,12],[113,2,113,3],[123,2,123,12],[124,2,124,12],[113,9,113,10],[115,2,115,3],[117,2,117,3],[130,2,130,3],[132,2,132,3],[98,2,98,3],[108,2,108,12],[109,2,109,12],[98,9,98,10],[100,9,100,10],[100,2,100,3],[102,2,102,3],[102,9,102,10],[117,9,117,10],[132,9,132,10],[104,9,104,10],[119,9,119,10],[83,2,83,3],[93,2,93,12],[94,2,94,12],[83,9,83,10],[85,9,85,10],[85,2,85,3],[87,2,87,3],[87,9,87,10],[89,9,89,10],[78,2,78,12],[79,2,79,12],[53,2,53,3],[63,2,63,12],[64,2,64,12],[53,9,53,10],[55,9,55,10],[68,9,68,10],[70,9,70,10],[55,2,55,3],[57,2,57,3],[70,2,70,3],[72,2,72,3],[72,9,72,10],[59,9,59,10],[74,9,74,10],[49,2,49,12],[23,2,23,3],[33,2,33,12],[34,2,34,12],[68,2,68,3],[23,9,23,10],[25,9,25,10],[38,9,38,10],[40,9,40,10],[25,2,25,3],[27,2,27,3],[40,2,40,3],[42,2,42,3],[57,9,57,10],[29,9,29,10],[44,9,44,10],[8,2,8,3],[38,2,38,3],[48,2,48,12],[18,2,18,12],[19,2,19,12],[8,9,8,10],[10,2,10,3],[12,2,12,3],[27,9,27,10],[42,9,42,10],[10,9,10,10],[12,9,12,10],[14,9,14,10]]}
[{"$f":"Development!B3","v":"Home Energy Assessment"}]
[null,"Lighting"]
[]
[]
[null,null,null,"% of Home LED Lighting:"]
[]
[]
[{"$f":"A3+1","v":1}]
{"$rows_left_out":147}
{"sheet":"HEA_References","index":13,"n_rows":240,"n_cols":11,"rows_kept":240,"cut":false,"hidden":true,"merged":[]}
[]
[null,null,null,null,null,null,null,"Home Data "]
[null,"Domestic Hot Water",null,null,null,null,null,"Rate Code"]
[null,null,null,null,null,null,null,180]
[null,"Heating Source",null,"Heating Source",null,null,null,380]
[null,"Gas",null,"Yes",null,null,null,580]
[null,"Oil",null,"No",null,null,null,880]
[null,"Electric",null,"N/A",null,null,null,"N/A"]
{"$rows_left_out":233}
{"sheet":"Appliances Data Collection","index":14,"n_rows":152,"n_cols":9,"rows_kept":152,"cut":false,"hidden":false,"merged":[[66,9,66,10],[76,2,76,12],[85,2,85,5],[83,2,83,5],[100,2,100,5],[98,2,98,5],[96,2,96,5],[6,9,6,10],[8,9,8,10],[10,9,10,10],[21,9,21,10],[23,9,23,10],[16,2,16,12],[17,2,17,12],[115,2,115,5],[6,2,6,5],[8,2,8,5],[10,2,10,5],[25,2,26,5],[31,2,31,12],[32,2,32,12],[61,2,61,12],[62,2,62,12],[47,2,47,12],[106,2,106,12],[107,2,107,12],[70,2,70,5],[81,2,81,5],[77,2,77,12],[81,9,81,10],[113,9,113,10],[91,2,91,12],[92,2,92,12],[83,9,83,10],[85,9,85,10],[96,9,96,10],[53,9,53,10],[55,9,55,10],[23,2,23,5],[21,2,21,5],[46,2,46,12],[40,9,40,10],[51,9,51,10],[55,2,55,5],[53,2,53,5],[51,2,51,5],[38,2,38,5],[36,2,36,5],[40,2,40,5],[38,9,38,10],[25,9,25,10],[36,9,36,10],[128,2,128,5],[126,2,126,5],[68,2,68,5],[66,2,66,5],[121,2,121,12],[122,2,122,12],[113,2,113,5],[111,2,111,5],[68,9,68,10],[70,9,70,10],[98,9,98,10],[100,9,100,10],[111,9,111,10],[115,9,115,10],[126,9,126,10],[128,9,128,10],[152,2,152,12],[130,2,130,5],[143,9,143,10],[141,9,141,10],[137,2,137,12],[145,9,145,10],[151,2,151,12],[145,2,145,5],[143,2,143,5],[141,2,141,5],[136,2,136,12],[130,9,130,10]]}
[{"$f":"Development!B3","v":"Home Energy Assessment"}]
[null,"Appliances"]
[]
[]
[]
[{"$f":"A3+1","v":1}]
[null,"Appliance:",null,null,null,null,null,null,"Age:"]
[]
{"$rows_left_out":145}
{"sheet":"Window Data Collection","index":15,"n_rows":66,"n_cols":9,"rows_kept":66,"cut":false,"hidden":false,"merged":[[7,2,7,9],[59,2,59,3],[9,2,9,3],[11,2,11,3],[17,2,17,12],[18,2,18,12],[23,2,23,9],[25,2,25,3],[65,2,65,12],[66,2,66,12],[27,2,27,3],[43,2,43,3],[33,2,33,12],[50,2,50,12],[49,2,49,12],[34,2,34,12],[39,2,39,9],[41,2,41,3],[55,2,55,9],[57,2,57,3]]}
[{"$f":"Development!B3","v":"Home Energy Assessment"}]
[null,"Windows"]
[]
[]
[]
[null,"North Wall Windows"]
[]
[null,"Predominant Frame Type:"]
{"$rows_left_out":59}
{"sheet":"Health&Safety_Data","index":16,"n_rows":42,"n_cols":11,"rows_kept":42,"cut":false,"hidden":false,"merged":[[35,2,35,12],[41,2,41,12],[19,3,19,12],[4,1,5,12],[8,5,8,7],[8,10,8,12],[9,5,9,7],[10,5,10,7],[10,11,10,12],[11,11,11,12],[12,10,12,12],[26,9,26,12],[28,2,28,12],[29,2,29,12]]}
[{"$f":"Development!B3","v":"Home Energy Assessment"}]
[null,"Health & Safety"]
[]
["Health & Safety Conditions Acknowledgement"]
[null,"The conditions indicated below were observed during the inspection process. No guarantees are made or implied that all such \nconditions have been found."]
[]
[null,"Health and Safety Conditions Found:"]
[null,null,"Furnace/Boiler not drafting",null,null,"Gas Leak, location:",null,null,null,null,"Water flooding in basement"]
{"$rows_left_out":35}
{"sheet":"Other Data Collection","index":17,"n_rows":6,"n_cols":8,"rows_kept":6,"cut":false,"hidden":false,"merged":[]}
[{"$f":"Development!B3","v":"Home Energy Assessment"}]
[null,"Other Equipment"]
[]
[]
[]
[null,"Item #","Location","Equipment Type","Description","Qty","Approx. Age (years)","Additional Information"]

{"sheet":"Cover","index":18,"n_rows":44,"n_cols":4,"rows_kept":44,"cut":false,"hidden":true,"merged":[[42,3,42,4],[43,2,43,5],[8,0,11,8]]}
[]
[]
[]
[]
[]
[]
[]
[]
{"$rows_left_out":37}
{"sheet":"Executive Summary","index":19,"n_rows":36,"n_cols":10,"rows_kept":36,"cut":false,"hidden":true,"merged":[[5,1,5,8],[7,2,7,4],[9,2,9,4],[35,1,36,8],[16,2,16,4],[10,2,10,4],[11,2,11,4],[13,2,13,4],[14,2,14,4],[15,2,15,4],[22,0,22,1],[23,0,23,1],[24,0,24,1],[28,0,28,1],[30,0,30,1],[20,0,20,1],[20,2,20,4],[30,10,30,11],[22,2,22,4],[24,2,24,4],[28,2,28,4],[29,0,29,1],[30,2,30,4],[22,6,22,7],[24,10,24,11],[27,1,27,2],[27,3,27,5],[27,6,27,8],[27,9,27,10],[26,0,26,1],[26,2,26,4]]}
[{"$f":"Development!B3","v":"Home Energy Assessment"}]
[null,"Summary"]
[]
[]
[]
[null,"Thank you for the opportunity to visit your home! Our Home Performance with ENERGY STAR Program has performed a thorough inspection of your home to test for the overall energy performance and address any concerns you may have. This Home Energy Assessment will provide information to help you understand your energy usage as well as tips and recommendations to help you save more on your energy bill.  Be sure to take note of all the PSEG Long Island Energy Efficiency Rebates that are available to you."]
[]
[null,"Home Owner:",{"$f":"IF('Home Data'!C7=\"\",\"\",'Home Data'!C7)","v":""}]
{"$rows_left_out":29}
{"sheet":"Health&Safety","index":20,"n_rows":42,"n_cols":17,"rows_kept":42,"cut":false,"hidden":true,"merged":[[35,4,35,17],[41,4,41,17],[4,2,5,17],[11,16,11,17],[12,15,12,17],[26,13,26,17],[28,4,28,17],[29,4,29,17],[8,8,8,10],[8,15,8,17],[9,8,9,10],[10,8,10,10],[10,16,10,17],[19,5,19,17]]}
[{"$f":"Development!B3","v":"Home Energy Assessment"}]
[null,"Health and Safety"]
[]
[null,"Health & Safety Conditions Acknowledgement"]
[null,null,"The conditions indicated below were observed during a limited inspection process. No guarantees are made or implied that all such conditions have been found."]
[]
[null,null,"Health and Safety Conditions Found:"]
[null,null,{"$f":"'Health&Safety_Data'!B8","v":0},null,"Furnace/Boiler not drafting",null,{"$f":"'Health&Safety_Data'!E8","v":0},null,"Gas Leak, location:",null,null,null,null,{"$f":"'Health&Safety_Data'!J8","v":0},null,"Water flooding in basement"]
{"$rows_left_out":35}
{"sheet":"Heating and Cooling","index":21,"n_rows":42,"n_cols":14,"rows_kept":42,"cut":false,"hidden":true,"merged":[[28,2,31,13],[32,2,35,13],[37,2,38,13],[8,10,8,11],[10,8,10,13],[19,8,19,13],[10,2,10,5],[19,2,19,5],[4,3,4,7],[5,3,5,7],[6,3,6,7],[4,12,4,13],[5,12,5,13]]}
[{"$f":"Development!B3","v":"Home Energy Assessment"}]
[null,"Heating and Cooling Assessment Results"]
[]
[null,null,"Assessment Results"]
[null,null,"Customer Name:",{"$f":"IF('Home Data'!C7=\"\",\"\",'Home Data'!C7)","v":""},null,null,null,null,null,null,null,"Assessor Name:",{"$f":"IF('Home Data'!$C$22=\"\",\"\",'Home Data'!$C$22)","v":""}]
[null,null,"Customer Address:",{"$f":"IF('Home Data'!C9=\"\",\"\",'Home Data'!C9&\", \"&'Home Data'!C11)","v":""},null,null,null,null,null,null,null,"Date of Assessment:",{"$f":"IF('Home Data'!$C$20=\"\",\"\",'Home Data'!$C$20)","v":""}]
[null,null,"Customer E-mail:",{"$f":"IF('Home Data'!C15=\"\",\"\",'Home Data'!C15)","v":""}]
[]
{"$rows_left_out":35}
{"sheet":"DHW","index":22,"n_rows":29,"n_cols":13,"rows_kept":29,"cut":false,"hidden":true,"merged":[[27,1,27,13],[20,1,23,12],[24,1,24,12],[4,2,4,5],[5,2,5,5],[6,2,6,5],[8,8,8,9],[10,1,10,4],[19,1,19,2],[10,7,10,12],[5,11,5,13],[4,11,4,13]]}
[{"$f":"Development!B3","v":"Home Energy Assessment"}]
[null,"Domestic Hot Water Assessment Results"]
[]
[null,"Assessment Results"]
[null,"Customer Name:",{"$f":"IF('Home Data'!C7=\"\",\"\",'Home Data'!C7)","v":""},null,null,null,null,null,null,"Assessor Name:",null,{"$f":"IF('Home Data'!$C$22=\"\",\"\",'Home Data'!$C$22)","v":""}]
[null,"Customer Address:",{"$f":"IF('Home Data'!C9=\"\",\"\",'Home Data'!C9&\", \"&'Home Data'!C11)","v":""},null,null,null,null,null,null,"Date of Assessment:",null,{"$f":"IF('Home Data'!$C$20=\"\",\"\",'Home Data'!$C$20)","v":""}]
[null,"Customer E-mail:",{"$f":"IF('Home Data'!C15=\"\",\"\",'Home Data'!C15)","v":""}]
[]
{"$rows_left_out":22}
{"sheet":"Insulation Levels","index":23,"n_rows":37,"n_cols":11,"rows_kept":37,"cut":false,"hidden":true,"merged":[[4,9,4,12],[5,9,5,12],[36,1,36,10],[30,1,30,2],[31,1,33,10],[34,1,34,10],[4,2,4,4],[5,2,5,4],[6,2,6,4],[8,7,8,8],[24,1,24,4],[10,7,10,12],[17,7,17,12],[24,7,24,12],[10,1,10,5],[17,1,17,5]]}
[{"$f":"Development!B3","v":"Home Energy Assessment"}]
[null,"Insulation Assessment Results"]
[]
[null,"Assessment Results"]
[null,"Customer Name:",{"$f":"IF('Home Data'!C7=\"\",\"\",'Home Data'!C7)","v":""},null,null,null,null,null,"Assessor Name:",{"$f":"IF('Home Data'!$C$22=\"\",\"\",'Home Data'!$C$22)","v":""}]
[null,"Customer Address:",{"$f":"IF('Home Data'!C9=\"\",\"\",'Home Data'!C9&\", \"&'Home Data'!C11)","v":""},null,null,null,null,null,"Date of Assessment:",{"$f":"IF('Home Data'!$C$20=\"\",\"\",'Home Data'!$C$20)","v":""}]
[null,"Customer E-mail:",{"$f":"IF('Home Data'!C15=\"\",\"\",'Home Data'!C15)","v":""}]
[]
{"$rows_left_out":30}
{"sheet":"Air_Sealing ","index":24,"n_rows":26,"n_cols":12,"rows_kept":26,"cut":false,"hidden":true,"merged":[[4,10,4,13],[5,10,5,13],[25,1,25,12],[4,2,4,5],[5,2,5,5],[6,2,6,5],[8,8,8,9],[16,1,16,2],[12,4,12,5],[13,4,13,5],[12,11,12,12],[13,11,13,12],[11,1,11,5],[11,8,11,12],[17,1,21,12],[22,1,22,12]]}
[{"$f":"Development!B3","v":"Home Energy Assessment"}]
[null,"Air Sealing Assessment Results"]
[]
[null,"Assessment Results"]
[null,"Customer Name:",{"$f":"IF('Home Data'!C7=\"\",\"\",'Home Data'!C7)","v":""},null,null,null,null,null,null,"Assessor Name:",{"$f":"IF('Home Data'!$C$22=\"\",\"\",'Home Data'!$C$22)","v":""}]
[null,"Customer Address:",{"$f":"IF('Home Data'!C9=\"\",\"\",'Home Data'!C9&\", \"&'Home Data'!C11)","v":""},null,null,null,null,null,null,"Date of Assessment:",{"$f":"IF('Home Data'!$C$20=\"\",\"\",'Home Data'!$C$20)","v":""}]
[null,"Customer E-mail:",{"$f":"IF('Home Data'!C15=\"\",\"\",'Home Data'!C15)","v":""}]
[]
{"$rows_left_out":19}
{"sheet":"Duct Sealing","index":25,"n_rows":27,"n_cols":12,"rows_kept":27,"cut":false,"hidden":true,"merged":[[24,1,25,11],[17,1,17,4],[8,8,8,9],[23,1,23,2],[4,2,4,5],[5,2,5,5],[6,2,6,5],[10,1,10,5],[10,8,10,12],[17,8,17,12],[5,10,5,12],[4,10,4,12]]}
[{"$f":"Development!B3","v":"Home Energy Assessment"}]
[null,"Duct Sealing Assessment Results"]
[]
[null,"Assessment Results"]
[null,"Customer Name:",{"$f":"IF('Home Data'!C7=\"\",\"\",'Home Data'!C7)","v":""},null,null,null,null,null,null,"Assessor Name:",{"$f":"IF('Home Data'!$C$22=\"\",\"\",'Home Data'!$C$22)","v":""}]
[null,"Customer Address:",{"$f":"IF('Home Data'!C9=\"\",\"\",'Home Data'!C9&\", \"&'Home Data'!C11)","v":""},null,null,null,null,null,null,"Date of Assessment:",{"$f":"IF('Home Data'!$C$20=\"\",\"\",'Home Data'!$C$20)","v":""}]
[null,"Customer E-mail:",{"$f":"IF('Home Data'!C15=\"\",\"\",'Home Data'!C15)","v":""}]
[]
{"$rows_left_out":20}
{"sheet":"Thermostats and Controls","index":26,"n_rows":30,"n_cols":11,"rows_kept":30,"cut":false,"hidden":true,"merged":[[29,1,29,3],[27,1,27,9],[28,1,28,10],[18,1,19,10],[22,1,23,10],[24,1,26,10],[20,2,21,10],[8,7,8,8],[10,1,10,4],[17,1,17,2],[4,2,4,4],[5,2,5,4],[6,2,6,4],[10,7,10,11],[4,9,4,11],[5,9,5,11]]}
[{"$f":"Development!B3","v":"Home Energy Assessment"}]
[null,"Thermostats and Controls Assessment Results"]
[]
[null,"Assessment Results"]
[null,"Customer Name:",{"$f":"IF('Home Data'!C7=\"\",\"\",'Home Data'!C7)","v":""},null,null,null,null,null,"Assessor Name:",{"$f":"IF('Home Data'!$C$22=\"\",\"\",'Home Data'!$C$22)","v":""}]
[null,"Customer Address:",{"$f":"IF('Home Data'!C9=\"\",\"\",'Home Data'!C9&\", \"&'Home Data'!C11)","v":""},null,null,null,null,null,"Date of Assessment:",{"$f":"IF('Home Data'!$C$20=\"\",\"\",'Home Data'!$C$20)","v":""}]
[null,"Customer E-mail:",{"$f":"IF('Home Data'!C15=\"\",\"\",'Home Data'!C15)","v":""}]
[]
{"$rows_left_out":23}
{"sheet":"Lighting","index":27,"n_rows":55,"n_cols":11,"rows_kept":55,"cut":false,"hidden":true,"merged":[[54,1,55,11],[50,1,51,11],[52,1,52,11],[8,7,8,8],[4,2,4,5],[5,2,5,5],[6,2,6,5],[4,9,4,11],[5,9,5,11]]}
[{"$f":"Development!B3","v":"Home Energy Assessment"}]
[null,"Lighting Assessment Results"]
[]
[null,"Assessment Results"]
[null,"Customer Name:",{"$f":"IF('Home Data'!C7=\"\",\"\",'Home Data'!C7)","v":""},null,null,null,null,null,"Assessor Name:",{"$f":"IF('Home Data'!$C$22=\"\",\"\",'Home Data'!$C$22)","v":""}]
[null,"Customer Address:",{"$f":"IF('Home Data'!C9=\"\",\"\",'Home Data'!C9&\", \"&'Home Data'!C11)","v":""},null,null,null,null,null,"Date of Assessment:",{"$f":"IF('Home Data'!$C$20=\"\",\"\",'Home Data'!$C$20)","v":""}]
[null,"Customer E-mail:",{"$f":"IF('Home Data'!C15=\"\",\"\",'Home Data'!C15)","v":""}]
[]
{"$rows_left_out":48}
{"sheet":"Appliances","index":28,"n_rows":45,"n_cols":11,"rows_kept":45,"cut":false,"hidden":true,"merged":[[36,1,37,10],[38,1,38,11],[40,1,41,11],[42,1,43,11],[44,1,44,11],[8,7,8,8],[4,2,4,6],[5,2,5,6],[6,2,6,6],[4,9,4,11],[5,9,5,11]]}
[{"$f":"Development!B3","v":"Home Energy Assessment"}]
[null,"Thermostats and Controls Assessment Results"]
[]
[null,"Assessment Results"]
[null,"Customer Name:",{"$f":"IF('Home Data'!C7=\"\",\"\",'Home Data'!C7)","v":""},null,null,null,null,null,"Assessor Name:",{"$f":"IF('Home Data'!$C$22=\"\",\"\",'Home Data'!$C$22)","v":""}]
[null,"Customer Address:",{"$f":"IF('Home Data'!C9=\"\",\"\",'Home Data'!C9&\", \"&'Home Data'!C11)","v":""},null,null,null,null,null,"Date of Assessment:",{"$f":"IF('Home Data'!$C$20=\"\",\"\",'Home Data'!$C$20)","v":""}]
[null,"Customer E-mail:",{"$f":"IF('Home Data'!C15=\"\",\"\",'Home Data'!C15)","v":""}]
[]
{"$rows_left_out":38}
{"sheet":"Windows","index":29,"n_rows":46,"n_cols":7,"rows_kept":46,"cut":false,"hidden":true,"merged":[[4,6,4,7],[5,6,5,7],[8,4,8,5],[31,1,31,2],[32,1,34,6],[10,1,10,3],[18,1,18,3],[10,5,10,7],[18,5,18,7]]}
[{"$f":"Development!B3","v":"Home Energy Assessment"}]
[null,"Window Assessment Results"]
[]
[null,"Assessment Results"]
[null,"Customer Name:",{"$f":"IF('Home Data'!C7=\"\",\"\",'Home Data'!C7)","v":""},null,null,"Assessor Name:",{"$f":"IF('Home Data'!$C$22=\"\",\"\",'Home Data'!$C$22)","v":""}]
[null,"Customer Address:",{"$f":"IF('Home Data'!C9=\"\",\"\",'Home Data'!C9&\", \"&'Home Data'!C11)","v":""},null,null,"Date of Assessment:",{"$f":"IF('Home Data'!$C$20=\"\",\"\",'Home Data'!$C$20)","v":""}]
[null,"Customer E-mail:",{"$f":"IF('Home Data'!C15=\"\",\"\",'Home Data'!C15)","v":""}]
[]
{"$rows_left_out":38}